Reaction Details
TargetHexokinase-4
LigandBDBM50444409
Substrate/Competitorn/a
Meas. Tech.ChEMBL_1279785 (CHEMBL3095486)
IC50 1700±n/a nM
Citation Stevens, BDLitchfield, JPfefferkorn, JAAtkinson, KPerreault, CAmor, PBahnck, KBerliner, MACalloway, JCarlo, ADerksen, DRFilipski, KJGumkowski, MJassal, CMacDougall, MMurphy, BNkansah, PPettersen, JRotter, CZhang, Y Discovery of an intravenous hepatoselective glucokinase activator for the treatment of inpatient hyperglycemia. Bioorg Med Chem Lett23:6588-92 (2013) 
 
Hexokinase-4
Name:Hexokinase-4
Type:PROTEIN
Mol. Mass.:52101.81
Organism:Rattus norvegicus
Description:ChEMBL_1279785
Residue:465
BDBM50444409
NameBDBM50444409
Synonyms:CHEMBL3091581
TypeSmall organic molecule
Emp. Form.C21H26N4O5S
Mol. Mass.446.52
SMILESOC(=O)c1ccc(NC(=O)[C@H](CC2CCCC2)n2cnc(c2)S(=O)(=O)C2CCC2)nc1