Reaction Details
TargetP2X purinoceptor 1
LigandBDBM50102295
Substrate/Competitorn/a
Meas. Tech.ChEMBL_1280008 (CHEMBL3096835)
IC50 43±n/a nM
Citation Cho, JHJung, KYJung, YKim, MHKo, HPark, CSKim, YC Design and synthesis of potent and selective P2X3 receptor antagonists derived from PPADS as potential pain modulators. Eur J Med Chem70:811-30 (2013) 
 
P2X purinoceptor 1
Name:P2X purinoceptor 1
Type:Enzyme Catalytic Domain
Mol. Mass.:44969.95
Organism:RAT
Description:Purinergic, P2X1 0 RAT::P47824
Residue:399
BDBM50102295
NameBDBM50102295
Synonyms:4-(4-Formyl-5-hydroxy-6-methyl-3-phosphonooxymethyl-pyridin-2-ylazo)-benzoic acid | CHEMBL119235
TypeSmall organic molecule
Emp. Form.C15H14N3O8P
Mol. Mass.395.2607
SMILESCc1nc(N=Nc2ccc(cc2)C(O)=O)c(COP(O)(O)=O)c(C=O)c1O