Reaction Details
TargetP2X purinoceptor 1
LigandBDBM50444425
Substrate/Competitorn/a
Meas. Tech.ChEMBL_1280016 (CHEMBL3096843)
IC50 446±n/a nM
Citation Cho, JHJung, KYJung, YKim, MHKo, HPark, CSKim, YC Design and synthesis of potent and selective P2X3 receptor antagonists derived from PPADS as potential pain modulators. Eur J Med Chem70:811-30 (2013) 
 
P2X purinoceptor 1
Name:P2X purinoceptor 1
Type:PROTEIN
Mol. Mass.:44863.39
Organism:Mus musculus
Description:ChEMBL_1280016
Residue:399
BDBM50444425
NameBDBM50444425
Synonyms:CHEMBL3091607
TypeSmall organic molecule
Emp. Form.C17H17NO6
Mol. Mass.331.32
SMILESCOc1ccc(CCc2nc(C)c(O)c(C(O)=O)c2C(O)=O)cc1