Reaction Details
TargetP2Y purinoceptor 1
LigandBDBM50444484
Substrate/Competitorn/a
Meas. Tech.ChEMBL_1277497 (CHEMBL3096017)
Ki 57±n/a nM
Citation Ruel, RL'Heureux, AThibeault, CLapointe, PMartel, AQiao, JXHua, JPrice, LAWu, QChang, MZheng, JHuang, CSWexler, RRRehfuss, RLam, PY Potent P2Y1 urea antagonists bearing various cyclic amine scaffolds. Bioorg Med Chem Lett23:6825-8 (2013) 
 
P2Y purinoceptor 1
Name:P2Y purinoceptor 1
Type:Enzyme
Mol. Mass.:42090.25
Organism:Homo sapiens (Human)
Description:P47900
Residue:373
BDBM50444484
NameBDBM50444484
Synonyms:CHEMBL3092629
TypeSmall organic molecule
Emp. Form.C26H27F3N4O3
Mol. Mass.500.5128
SMILESCN1Cc2cccc(Oc3ncccc3NC(=O)Nc3ccc(OC(F)(F)F)cc3)c2C1C(C)(C)C