Reaction Details
TargetHistamine H3 receptor
LigandBDBM50444497
Substrate/Competitorn/a
Meas. Tech.ChEMBL_1277742 (CHEMBL3097342)
Ki 2.5±n/a nM
Citation Wilson, DMApps, JBailey, NBamford, MJBeresford, IJBrackenborough, KBriggs, MABrough, SCalver, ARCrook, BDavis, RKDavis, RPDavis, SDean, DKHarris, LHeslop, THolland, VJeffrey, PPanchal, TAParr, CAQuashie, NSchogger, JSehmi, SSStean, TOSteadman, JGTrail, BWald, JWorby, ATakle, AKWitherington, JMedhurst, AD Identification of clinical candidates from the benzazepine class of histamine H3 receptor antagonists. Bioorg Med Chem Lett23:6890-6 (2013) 
 
Histamine H3 receptor
Name:Histamine H3 receptor
Type:G Protein-Coupled Receptor (GPCR)
Mol. Mass.:48607.98
Organism:Rattus norvegicus (rat)
Description:n/a
Residue:445
BDBM50444497
NameBDBM50444497
Synonyms:CHEMBL3092649
TypeSmall organic molecule
Emp. Form.C22H24N4O
Mol. Mass.360.4522
SMILESC1CC(C1)N1CCc2ccc(Oc3ccc(cn3)-c3cc[nH]n3)cc2CC1