Reaction Details
TargetCytochrome P450 11B2, mitochondrial
LigandBDBM50444550
Substrate/Competitorn/a
Meas. Tech.ChEMBL_1281888 (CHEMBL3101041)
IC50 0.400000±n/a nM
Citation Meredith, ELKsander, GMonovich, LGPapillon, JPLiu, QMiranda, KMorris, PRao, CBurgis, RCapparelli, MHu, QYSingh, ARigel, DFJeng, AYBeil, MFu, FHu, CWLaSala, D Discovery and in Vivo Evaluation of Potent Dual CYP11B2 (Aldosterone Synthase) and CYP11B1 Inhibitors. ACS Med Chem Lett4:1203-7 (2013) 
 
Cytochrome P450 11B2, mitochondrial
Name:Cytochrome P450 11B2, mitochondrial
Type:Protein
Mol. Mass.:57582.15
Organism:Homo sapiens (Human)
Description:P19099
Residue:503
BDBM50444550
NameBDBM50444550
Synonyms:CHEMBL3099704
TypeSmall organic molecule
Emp. Form.C21H18FN3
Mol. Mass.331.3861
SMILESFc1ccc(cc1)-c1cc(ccc1[C@H]1CCCCc2cncn12)C#N