Reaction Details
TargetCytochrome P450 2C9
LigandBDBM50444549
Substrate/Competitorn/a
Meas. Tech.ChEMBL_1281890 (CHEMBL3101164)
IC50>10000±n/a nM
Citation Meredith, ELKsander, GMonovich, LGPapillon, JPLiu, QMiranda, KMorris, PRao, CBurgis, RCapparelli, MHu, QYSingh, ARigel, DFJeng, AYBeil, MFu, FHu, CWLaSala, D Discovery and in Vivo Evaluation of Potent Dual CYP11B2 (Aldosterone Synthase) and CYP11B1 Inhibitors. ACS Med Chem Lett4:1203-7 (2013) 
 
Cytochrome P450 2C9
Name:Cytochrome P450 2C9
Type:Enzyme
Mol. Mass.:55636.33
Organism:Homo sapiens (Human)
Description:P11712
Residue:490
BDBM50444549
NameBDBM50444549
Synonyms:CHEMBL3099695
TypeSmall organic molecule
Emp. Form.C13H10FN3
Mol. Mass.227.237
SMILESFc1cc(ccc1[C@H]1CCc2cncn12)C#N