Reaction Details
TargetCytochrome P450 11B2, mitochondrial
LigandBDBM50444549
Substrate/Competitorn/a
Meas. Tech.ChEMBL_1281894 (CHEMBL3101168)
IC50 9.0±n/a nM
Citation Meredith, ELKsander, GMonovich, LGPapillon, JPLiu, QMiranda, KMorris, PRao, CBurgis, RCapparelli, MHu, QYSingh, ARigel, DFJeng, AYBeil, MFu, FHu, CWLaSala, D Discovery and in Vivo Evaluation of Potent Dual CYP11B2 (Aldosterone Synthase) and CYP11B1 Inhibitors. ACS Med Chem Lett4:1203-7 (2013) 
 
Cytochrome P450 11B2, mitochondrial
Name:Cytochrome P450 11B2, mitochondrial
Type:Protein
Mol. Mass.:57582.15
Organism:Homo sapiens (Human)
Description:P19099
Residue:503
BDBM50444549
NameBDBM50444549
Synonyms:CHEMBL3099695
TypeSmall organic molecule
Emp. Form.C13H10FN3
Mol. Mass.227.237
SMILESFc1cc(ccc1[C@H]1CCc2cncn12)C#N