Reaction Details
TargetCytochrome P450 11B2, mitochondrial
LigandBDBM50444570
Substrate/Competitorn/a
Meas. Tech.ChEMBL_1281894 (CHEMBL3101168)
IC50 37±n/a nM
Citation Meredith, ELKsander, GMonovich, LGPapillon, JPLiu, QMiranda, KMorris, PRao, CBurgis, RCapparelli, MHu, QYSingh, ARigel, DFJeng, AYBeil, MFu, FHu, CWLaSala, D Discovery and in Vivo Evaluation of Potent Dual CYP11B2 (Aldosterone Synthase) and CYP11B1 Inhibitors. ACS Med Chem Lett4:1203-7 (2013) 
 
Cytochrome P450 11B2, mitochondrial
Name:Cytochrome P450 11B2, mitochondrial
Type:Protein
Mol. Mass.:57582.15
Organism:Homo sapiens (Human)
Description:P19099
Residue:503
BDBM50444570
NameBDBM50444570
Synonyms:CHEMBL3099699
TypeSmall organic molecule
Emp. Form.C19H18N2
Mol. Mass.274.3596
SMILESC1C[C@H](c2ccccc2-c2ccccc2)n2cncc2C1