Reaction Details
TargetCytochrome P450 11B2, mitochondrial
LigandBDBM50047262
Substrate/Competitorn/a
Meas. Tech.ChEMBL_1281894 (CHEMBL3101168)
IC50 30±n/a nM
Citation Meredith, ELKsander, GMonovich, LGPapillon, JPLiu, QMiranda, KMorris, PRao, CBurgis, RCapparelli, MHu, QYSingh, ARigel, DFJeng, AYBeil, MFu, FHu, CWLaSala, D Discovery and in Vivo Evaluation of Potent Dual CYP11B2 (Aldosterone Synthase) and CYP11B1 Inhibitors. ACS Med Chem Lett4:1203-7 (2013) 
 
Cytochrome P450 11B2, mitochondrial
Name:Cytochrome P450 11B2, mitochondrial
Type:Protein
Mol. Mass.:57582.15
Organism:Homo sapiens (Human)
Description:P19099
Residue:503
BDBM50047262
NameBDBM50047262
Synonyms:(R)-4-(5,6,7,8-tetrahydroimidazo[1,5-a]pyridin-5-yl)benzonitrile CHEMBL287677 | R-fadrozole
TypeSmall organic molecule
Emp. Form.C14H13N3
Mol. Mass.223.2731
SMILESN#Cc1ccc(cc1)[C@H]1CCCc2cncn12