Reaction Details
TargetKallikrein-7
LigandBDBM50444601
Substrate/Competitorn/a
Meas. Tech.ChEMBL_1282441 (CHEMBL3100742)
Ki 44000±n/a nM
Citation Tan, XBertonati, CQin, LFurio, LEl Amri, CHovnanian, AReboud-Ravaux, MVilloutreix, BO Identification by in silico and in vitro screenings of small organic molecules acting as reversible inhibitors of kallikreins. Eur J Med Chem70:661-8 (2013) 
 
Kallikrein-7
Name:Kallikrein-7
Type:PROTEIN
Mol. Mass.:27535.05
Organism:Homo sapiens (Human)
Description:ChEMBL_1469257
Residue:253
BDBM50444601
NameBDBM50444601
Synonyms:CHEMBL3099881
TypeSmall organic molecule
Emp. Form.C23H16F3N5OS
Mol. Mass.467.466
SMILESNc1ccc2nc(SCc3nc4ccccc4c(=O)n3-c3cccc(c3)C(F)(F)F)[nH]c2c1