Reaction Details
TargetKallikrein-5 [D153N]
LigandBDBM50444597
Substrate/Competitorn/a
Meas. Tech.ChEMBL_1282444 (CHEMBL3100871)
Ki 95000±n/a nM
Citation Tan, XBertonati, CQin, LFurio, LEl Amri, CHovnanian, AReboud-Ravaux, MVilloutreix, BO Identification by in silico and in vitro screenings of small organic molecules acting as reversible inhibitors of kallikreins. Eur J Med Chem70:661-8 (2013) 
 
Kallikrein-5 [D153N]
Name:Kallikrein-5 [D153N]
Type:PROTEIN
Mol. Mass.:32031.75
Organism:Homo sapiens (Human)
Description:ChEMBL_1282456
Residue:293
BDBM50444597
NameBDBM50444597
Synonyms:CHEMBL3099882
TypeSmall organic molecule
Emp. Form.C20H19FN2O4S
Mol. Mass.402.439
SMILESCOc1ccc(\C=C2\SC(=O)N(CNc3cc(F)ccc3C)C2=O)cc1OC