Reaction Details
TargetKallikrein-5 [D153N]
LigandBDBM50444598
Substrate/Competitorn/a
Meas. Tech.ChEMBL_1282444 (CHEMBL3100871)
Ki 121000±n/a nM
Citation Tan, XBertonati, CQin, LFurio, LEl Amri, CHovnanian, AReboud-Ravaux, MVilloutreix, BO Identification by in silico and in vitro screenings of small organic molecules acting as reversible inhibitors of kallikreins. Eur J Med Chem70:661-8 (2013) 
 
Kallikrein-5 [D153N]
Name:Kallikrein-5 [D153N]
Type:PROTEIN
Mol. Mass.:32031.75
Organism:Homo sapiens (Human)
Description:ChEMBL_1282456
Residue:293
BDBM50444598
NameBDBM50444598
Synonyms:CHEMBL3099878
TypeSmall organic molecule
Emp. Form.C23H22N4O4
Mol. Mass.418.4452
SMILESCOc1cc(\C=C(\C#N)c2nc3ccccc3[nH]2)ccc1OCC(=O)N1CCOCC1