Reaction Details
TargetKallikrein-14
LigandBDBM50444600
Substrate/Competitorn/a
Meas. Tech.ChEMBL_1282452 (CHEMBL3100879)
IC50 96000±n/a nM
Citation Tan, XBertonati, CQin, LFurio, LEl Amri, CHovnanian, AReboud-Ravaux, MVilloutreix, BO Identification by in silico and in vitro screenings of small organic molecules acting as reversible inhibitors of kallikreins. Eur J Med Chem70:661-8 (2013) 
 
Kallikrein-14
Name:Kallikrein-14
Type:PROTEIN
Mol. Mass.:29136.99
Organism:Homo sapiens (Human)
Description:ChEMBL_1282452
Residue:267
BDBM50444600
NameBDBM50444600
Synonyms:CHEMBL1462676
TypeSmall organic molecule
Emp. Form.C22H18N4O2
Mol. Mass.370.4039
SMILESCNC(=O)c1ccc(Nc2nnc(-c3ccc(O)cc3)c3ccccc23)cc1