Reaction Details
TargetKallikrein-14
LigandBDBM50444599
Substrate/Competitorn/a
Meas. Tech.ChEMBL_1282452 (CHEMBL3100879)
IC50 87000±n/a nM
Citation Tan, XBertonati, CQin, LFurio, LEl Amri, CHovnanian, AReboud-Ravaux, MVilloutreix, BO Identification by in silico and in vitro screenings of small organic molecules acting as reversible inhibitors of kallikreins. Eur J Med Chem70:661-8 (2013) 
 
Kallikrein-14
Name:Kallikrein-14
Type:PROTEIN
Mol. Mass.:29136.99
Organism:Homo sapiens (Human)
Description:ChEMBL_1282452
Residue:267
BDBM50444599
NameBDBM50444599
Synonyms:CHEMBL3099875
TypeSmall organic molecule
Emp. Form.C21H20N2O6
Mol. Mass.396.3933
SMILESCCOc1cccc(NC(=O)C(=C/c2ccc(OCC(O)=O)c(OC)c2)\C#N)c1