Reaction Details
TargetKallikrein-14
LigandBDBM50444604
Substrate/Competitorn/a
Meas. Tech.ChEMBL_1282452 (CHEMBL3100879)
IC50 106000±n/a nM
Citation Tan, XBertonati, CQin, LFurio, LEl Amri, CHovnanian, AReboud-Ravaux, MVilloutreix, BO Identification by in silico and in vitro screenings of small organic molecules acting as reversible inhibitors of kallikreins. Eur J Med Chem70:661-8 (2013) 
 
Kallikrein-14
Name:Kallikrein-14
Type:PROTEIN
Mol. Mass.:29136.99
Organism:Homo sapiens (Human)
Description:ChEMBL_1282452
Residue:267
BDBM50444604
NameBDBM50444604
Synonyms:CHEMBL3099870
TypeSmall organic molecule
Emp. Form.C17H14N2O4
Mol. Mass.310.3041
SMILESCOc1cc(\C=C(\C#N)C(=O)Nc2ccc(O)cc2)ccc1O