Reaction Details
TargetKallikrein-5 [D153N]
LigandBDBM50444604
Substrate/Competitorn/a
Meas. Tech.ChEMBL_1282456 (CHEMBL3100883)
IC50 131000±n/a nM
Citation Tan, XBertonati, CQin, LFurio, LEl Amri, CHovnanian, AReboud-Ravaux, MVilloutreix, BO Identification by in silico and in vitro screenings of small organic molecules acting as reversible inhibitors of kallikreins. Eur J Med Chem70:661-8 (2013) 
 
Kallikrein-5 [D153N]
Name:Kallikrein-5 [D153N]
Type:PROTEIN
Mol. Mass.:32031.75
Organism:Homo sapiens (Human)
Description:ChEMBL_1282456
Residue:293
BDBM50444604
NameBDBM50444604
Synonyms:CHEMBL3099870
TypeSmall organic molecule
Emp. Form.C17H14N2O4
Mol. Mass.310.3041
SMILESCOc1cc(\C=C(\C#N)C(=O)Nc2ccc(O)cc2)ccc1O