Reaction Details
TargetOrexin receptor type 2
LigandBDBM50444611
Substrate/Competitorn/a
Meas. Tech.ChEMBL_1283184 (CHEMBL3101095)
Ki 0.700000±n/a nM
Citation Mercer, SPRoecker, AJGarson, SReiss, DRMeacham Harrell, CMurphy, KLBruno, JGBednar, RALemaire, WCui, DCabalu, TDTang, CPrueksaritanont, THartman, GDYoung, SDWinrow, CJRenger, JJColeman, PJ Discovery of 2,5-diarylnicotinamides as selective orexin-2 receptor antagonists (2-SORAs). Bioorg Med Chem Lett23:6620-4 (2013) 
 
Orexin receptor type 2
Name:Orexin receptor type 2
Type:Protein
Mol. Mass.:50710.53
Organism:Homo sapiens (Human)
Description:O43614
Residue:444
BDBM50444611
NameBDBM50444611
Synonyms:CHEMBL3099893
TypeSmall organic molecule
Emp. Form.C28H27N3O3
Mol. Mass.453.5323
SMILESCOc1ccc(CNC(=O)c2cc(cnc2-c2cccnc2)-c2cc(C)cc(C)c2)cc1OC