Reaction Details
TargetOrexin receptor type 2
LigandBDBM50444618
Substrate/Competitorn/a
Meas. Tech.ChEMBL_1283184 (CHEMBL3101095)
Ki 3.0±n/a nM
Citation Mercer, SPRoecker, AJGarson, SReiss, DRMeacham Harrell, CMurphy, KLBruno, JGBednar, RALemaire, WCui, DCabalu, TDTang, CPrueksaritanont, THartman, GDYoung, SDWinrow, CJRenger, JJColeman, PJ Discovery of 2,5-diarylnicotinamides as selective orexin-2 receptor antagonists (2-SORAs). Bioorg Med Chem Lett23:6620-4 (2013) 
 
Orexin receptor type 2
Name:Orexin receptor type 2
Type:Protein
Mol. Mass.:50710.53
Organism:Homo sapiens (Human)
Description:O43614
Residue:444
BDBM50444618
NameBDBM50444618
Synonyms:CHEMBL3099886
TypeSmall organic molecule
Emp. Form.C29H28N4O
Mol. Mass.448.5588
SMILESCN1CCc2cc(CNC(=O)c3cc(cnc3-c3cccnc3)-c3cc(C)cc(C)c3)ccc12