Reaction Details
TargetNicotinamide phosphoribosyltransferase
LigandBDBM50444654
Substrate/Competitorn/a
Meas. Tech.ChEMBL_1281258 (CHEMBL3100993)
IC50 1.7±n/a nM
Citation Zheng, XBaumeister, TBuckmelter, AJCaligiuri, MClodfelter, KHHan, BHo, YCKley, NLin, JReynolds, DJSharma, GSmith, CCWang, ZDragovich, PSOh, AWang, WZak, MWang, YYuen, PWBair, KW Discovery of potent and efficacious cyanoguanidine-containing nicotinamide phosphoribosyltransferase (Nampt) inhibitors. Bioorg Med Chem Lett24:337-43 (2013) 
 
Nicotinamide phosphoribosyltransferase
Name:Nicotinamide phosphoribosyltransferase
Type:Enzyme
Mol. Mass.:55524.98
Organism:Homo sapiens (Human)
Description:P43490
Residue:491
BDBM50444654
NameBDBM50444654
Synonyms:CHEMBL3098517
TypeSmall organic molecule
Emp. Form.C23H23N7O3S
Mol. Mass.477.539
SMILESO=S(=O)(c1ccc(CNC(NC#N)=Nc2ccncc2)cc1)c1ccc(nc1)N1CCOCC1