Reaction Details
TargetBeta-2 adrenergic receptor
LigandBDBM50151720
Substrate/Competitorn/a
Meas. Tech.ChEMBL_1282347 (CHEMBL3100398)
EC50 0.130000±n/a nM
Citation Huang, LShan, WZhou, QXie, JLai, KLi, X Design, synthesis and evaluation of dual pharmacologyß2-adrenoceptor agonists and PDE4 inhibitors. Bioorg Med Chem Lett24:249-53 (2013) 
 
Beta-2 adrenergic receptor
Name:Beta-2 adrenergic receptor
Type:Enzyme Catalytic Domain
Mol. Mass.:46993.24
Organism:GUINEA PIG
Description:adrenergic Beta2 ADRB2 GUINEA PIG::Q8K4Z4
Residue:418
BDBM50151720
NameBDBM50151720
Synonyms:ARFORMOTEROL TARTRATE CHEMBL605993 FORMOTEROL FUMARATE N-(2-Hydroxy-5-{1-hydroxy-2-[2-(4-methoxy-phenyl)-1-methyl-ethylamino]-ethyl}-phenyl)-formamide Symbicort | cid_9912089
TypeSmall organic molecule
Emp. Form.C19H24N2O4
Mol. Mass.344.4049
SMILESCOc1ccc(C[C@@H](C)NC[C@H](O)c2ccc(O)c(NC=O)c2)cc1