Reaction Details
TargetFarnesyl diphosphate synthase
LigandBDBM12576
Substrate/Competitorn/a
Meas. Tech.ChEMBL_1282366 (CHEMBL3100417)
IC50 74±n/a nM
Citation Ferrer-Casal, MLi, CGalizzi, MStortz, CASzajnman, SHDocampo, RMoreno, SNRodriguez, JB New insights into molecular recognition of 1,1-bisphosphonic acids by farnesyl diphosphate synthase. Bioorg Med Chem22:398-405 (2013) 
 
Farnesyl diphosphate synthase
Name:Farnesyl diphosphate synthase
Synonyms:n/a
Type:PROTEIN
Mol. Mass.:69493.18
Organism:Toxoplasma gondii
Description:ChEMBL_1282507
Residue:646
BDBM12576
NameBDBM12576
TypeSmall organic molecule
Emp. Form.C7H11NO7P2
Mol. Mass.283.1123
SMILESOC(Cc1cccnc1)(P(O)(O)=O)P(O)(O)=O