Reaction Details
TargetDelta carbonic anhydrase
LigandBDBM10886
Substrate/Competitorn/a
Meas. Tech.ChEMBL_1282543 (CHEMBL3101210)
Ki 394±n/a nM
Citation Vullo, DDel Prete, SOsman, SMDe Luca, VScozzafava, AAlothman, ZSupuran, CTCapasso, C Sulfonamide inhibition studies of thed-carbonic anhydrase from the diatom Thalassiosira weissflogii. Bioorg Med Chem Lett24:275-9 (2013) 
 
Delta carbonic anhydrase
Name:Delta carbonic anhydrase
Synonyms:ca1
Type:PROTEIN
Mol. Mass.:32261.40
Organism:Thalassiosira weissflogii
Description:ChEMBL_107983
Residue:281
BDBM10886
NameBDBM10886
TypeSmall organic molecule
Emp. Form.C8H8N4O4S3
Mol. Mass.320.369
SMILESNS(=O)(=O)c1nnc(NS(=O)(=O)c2ccccc2)s1