Reaction Details
TargetDelta carbonic anhydrase
LigandBDBM10857
Substrate/Competitorn/a
Meas. Tech.ChEMBL_1282543 (CHEMBL3101210)
Ki 181±n/a nM
Citation Vullo, DDel Prete, SOsman, SMDe Luca, VScozzafava, AAlothman, ZSupuran, CTCapasso, C Sulfonamide inhibition studies of thed-carbonic anhydrase from the diatom Thalassiosira weissflogii. Bioorg Med Chem Lett24:275-9 (2013) 
 
Delta carbonic anhydrase
Name:Delta carbonic anhydrase
Synonyms:ca1
Type:PROTEIN
Mol. Mass.:32261.40
Organism:Thalassiosira weissflogii
Description:ChEMBL_107983
Residue:281
BDBM10857
NameBDBM10857
TypeSmall organic molecule
Emp. Form.C6H8N2O2S
Mol. Mass.172.205
SMILESNc1ccc(cc1)S(N)(=O)=O