Reaction Details
TargetDelta carbonic anhydrase
LigandBDBM26999
Substrate/Competitorn/a
Meas. Tech.ChEMBL_1282543 (CHEMBL3101210)
Ki 169±n/a nM
Citation Vullo, DDel Prete, SOsman, SMDe Luca, VScozzafava, AAlothman, ZSupuran, CTCapasso, C Sulfonamide inhibition studies of thed-carbonic anhydrase from the diatom Thalassiosira weissflogii. Bioorg Med Chem Lett24:275-9 (2013) 
 
Delta carbonic anhydrase
Name:Delta carbonic anhydrase
Synonyms:ca1
Type:PROTEIN
Mol. Mass.:32261.40
Organism:Thalassiosira weissflogii
Description:ChEMBL_107983
Residue:281
BDBM26999
NameBDBM26999
TypeSmall organic molecule
Emp. Form.C10H14N2O4S2
Mol. Mass.290.359
SMILESNS(=O)(=O)c1ccc(cc1)N1CCCCS1(=O)=O