Reaction Details
TargetDelta carbonic anhydrase
LigandBDBM10863
Substrate/Competitorn/a
Meas. Tech.ChEMBL_1282543 (CHEMBL3101210)
Ki 167±n/a nM
Citation Vullo, DDel Prete, SOsman, SMDe Luca, VScozzafava, AAlothman, ZSupuran, CTCapasso, C Sulfonamide inhibition studies of thed-carbonic anhydrase from the diatom Thalassiosira weissflogii. Bioorg Med Chem Lett24:275-9 (2013) 
 
Delta carbonic anhydrase
Name:Delta carbonic anhydrase
Synonyms:ca1
Type:PROTEIN
Mol. Mass.:32261.40
Organism:Thalassiosira weissflogii
Description:ChEMBL_107983
Residue:281
BDBM10863
NameBDBM10863
TypeSmall organic molecule
Emp. Form.C6H7ClN2O2S
Mol. Mass.206.65
SMILESNc1ccc(cc1Cl)S(N)(=O)=O