Reaction Details
TargetTransporter
LigandBDBM50444867
Substrate/Competitorn/a
Meas. Tech.ChEMBL_1282844 (CHEMBL3102345)
Ki 198±n/a nM
Citation Sharma, HSantra, SDebnath, JAntonio, TReith, MDutta, A Flexible and biomimetic analogs of triple uptake inhibitor 4-((((3S,6S)-6-benzhydryltetrahydro-2H-pyran-3-yl)amino)methyl)phenol: Synthesis, biological characterization, and development of a pharmacophore model. Bioorg Med Chem22:311-24 (2013) 
 
Transporter
Name:Transporter
Type:Multi-pass membrane protein
Mol. Mass.:69236.90
Organism:Rattus norvegicus (rat)
Description:Q63380
Residue:617
BDBM50444867
NameBDBM50444867
Synonyms:CHEMBL3099488
TypeSmall organic molecule
Emp. Form.C26H29NO2
Mol. Mass.387.514
SMILESCOc1ccc(CCN[C@@H]2CO[C@@H](C2)C(c2ccccc2)c2ccccc2)cc1