Reaction Details
TargetProteasome subunit beta type-2
LigandBDBM50444905
Substrate/Competitorn/a
Meas. Tech.ChEMBL_1282984 (CHEMBL3100303)
IC50 880±n/a nM
Citation Hasegawa, MYasuda, YTanaka, MNakata, KUmeda, EWang, YWatanabe, CUetake, SKunoh, TShionyu, MSasaki, RShiina, IMizukami, T A novel tamoxifen derivative, ridaifen-F, is a nonpeptidic small-molecule proteasome inhibitor. Eur J Med Chem71:290-305 (2014) 
 
Proteasome subunit beta type-2
Name:Proteasome subunit beta type-2
Type:PROTEIN
Mol. Mass.:22837.53
Organism:Homo sapiens (Human)
Description:ChEMBL_1294233
Residue:201
BDBM50444905
NameBDBM50444905
Synonyms:CHEMBL3099635
TypeSmall organic molecule
Emp. Form.C30H42N2O2
Mol. Mass.462.6667
SMILESC=C(c1ccc(OCCN2CCCCCC2)cc1)c1ccc(OCCN2CCCCCC2)cc1