Reaction Details
TargetProteasome subunit beta type-5
LigandBDBM50444906
Substrate/Competitorn/a
Meas. Tech.ChEMBL_1282985 (CHEMBL3100304)
IC50 670±n/a nM
Citation Hasegawa, MYasuda, YTanaka, MNakata, KUmeda, EWang, YWatanabe, CUetake, SKunoh, TShionyu, MSasaki, RShiina, IMizukami, T A novel tamoxifen derivative, ridaifen-F, is a nonpeptidic small-molecule proteasome inhibitor. Eur J Med Chem71:290-305 (2014) 
 
Proteasome subunit beta type-5
Name:Proteasome subunit beta type-5
Type:Protein
Mol. Mass.:28480.96
Organism:Homo sapiens (Human)
Description:n/a
Residue:263
BDBM50444906
NameBDBM50444906
Synonyms:CHEMBL3099636
TypeSmall organic molecule
Emp. Form.C29H42N2O2
Mol. Mass.450.656
SMILESC(CN1CCCCCC1)Oc1ccc(Cc2ccc(OCCN3CCCCCC3)cc2)cc1