Reaction Details
TargetCyclin-dependent kinase 2
LigandBDBM50444918
Substrate/Competitorn/a
Meas. Tech.ChEMBL_1281330 (CHEMBL3101303)
Temperature298.15±n/a K
IC50>10000±n/a nM
Commentsextracted
Citation Deng, YShipps, GWZhao, LSiddiqui, MAPopovici-Muller, JCurran, PJDuca, JSHruza, AWFischmann, TOMadison, VSZhang, RMcNemar, CWMayhood, TWSyto, RAnnis, AKirschmeier, PLees, EMParry, DAWindsor, WT Modulating the interaction between CDK2 and cyclin A with a quinoline-based inhibitor. Bioorg Med Chem Lett24:199-203 (2013) 
 
Cyclin-dependent kinase 2
Name:Cyclin-dependent kinase 2
Type:Enzyme Subunit
Mol. Mass.:33938.17
Organism:Homo sapiens (Human)
Description:P24941
Residue:298
BDBM50444918
NameBDBM50444918
Synonyms:CHEMBL3099753
TypeSmall organic molecule
Emp. Form.C29H25ClN2O5
Mol. Mass.516.972
SMILESCOC[C@H](Cc1ccc(O)cc1)NC(=O)c1cc(C(O)=O)c2cc(\C=C\c3ccc(Cl)cc3)ccc2n1