Reaction Details
TargetCyclin-dependent kinase 2
LigandBDBM50444932
Substrate/Competitorn/a
Meas. Tech.ChEMBL_1281339 (CHEMBL3101312)
Kd 76±n/a nM
Citation Deng, YShipps, GWZhao, LSiddiqui, MAPopovici-Muller, JCurran, PJDuca, JSHruza, AWFischmann, TOMadison, VSZhang, RMcNemar, CWMayhood, TWSyto, RAnnis, AKirschmeier, PLees, EMParry, DAWindsor, WT Modulating the interaction between CDK2 and cyclin A with a quinoline-based inhibitor. Bioorg Med Chem Lett24:199-203 (2013) 
 
Cyclin-dependent kinase 2
Name:Cyclin-dependent kinase 2
Type:Enzyme Subunit
Mol. Mass.:33938.17
Organism:Homo sapiens (Human)
Description:P24941
Residue:298
BDBM50444932
NameBDBM50444932
Synonyms:CHEMBL3099764
TypeSmall organic molecule
Emp. Form.C27H30N2O6
Mol. Mass.478.5369
SMILESCCCCCCc1ccc2nc(cc(C(O)=O)c2c1)C(=O)N[C@@H](Cc1ccc(O)cc1)C(=O)OC