Reaction Details
TargetFe(3+)-pyochelin receptor
LigandBDBM50444961
Substrate/Competitorn/a
Meas. Tech.ChEMBL_1281512 (CHEMBL3101970)
Ki 460±n/a nM
Citation Noël, SHoegy, FRivault, FRognan, DSchalk, IJMislin, GL Synthesis and biological properties of thiazole-analogues of pyochelin, a siderophore of Pseudomonas aeruginosa. Bioorg Med Chem Lett24:132-5 (2013) 
 
Fe(3+)-pyochelin receptor
Name:Fe(3+)-pyochelin receptor
Type:PROTEIN
Mol. Mass.:79988.52
Organism:Pseudomonas aeruginosa (strain ATCC 15692 / PAO1 / 1C / PRS 101 / LMG12228)
Description:ChEMBL_107982
Residue:720
BDBM50444961
NameBDBM50444961
Synonyms:CHEMBL3099911
TypeSmall organic molecule
Emp. Form.C15H17N3O3S2
Mol. Mass.351.444
SMILESCOc1ccc(N)cc1-c1nc(cs1)C1SC[C@H](N1C)C(O)=O