Reaction Details
TargetCalcitonin gene-related peptide type 1 receptor/Receptor activity-modifying protein 1
LigandBDBM50444983
Substrate/Competitorn/a
Meas. Tech.ChEMBL_1281519 (CHEMBL3102085)
Ki 3.4±n/a nM
Citation Kim, JJWood, MRStachel, SJde Leon, PNomland, AStump, CAMcWherter, MASchirripa, KMMoore, ELSalvatore, CASelnick, HG (E)-Alkenes as replacements of amide bonds: development of novel and potent acyclic CGRP receptor antagonists. Bioorg Med Chem Lett24:258-61 (2013) 
 
Calcitonin gene-related peptide type 1 receptor/Receptor activity-modifying protein 1
Name:Calcitonin gene-related peptide type 1 receptor/Receptor activity-modifying protein 1
Synonyms:Calcitonin-gene-related peptide receptor, CALCRL/RAMP1
Type:n/a
Mol. Mass.:n/a
Description:ASSAY_ID of EBI is 327200
Components:This complex has 2 components.
Component 1
Name:Calcitonin gene-related peptide type 1 receptor
Type:Enzyme Catalytic Domain
Mol. Mass.:52980.45
Organism:Homo sapiens (Human)
Description:Q16602
Residue:461
Component 2
Name:Receptor activity-modifying protein 1
Synonyms:Calcitonin-gene-related peptide receptor, CALCRL/RAMP1 RAMP1_HUMAN
Type:PROTEIN
Mol. Mass.:16992.80
Organism:Homo sapiens (Human)
Description:EBI_100673
Residue:148
BDBM50444983
NameBDBM50444983
Synonyms:CHEMBL3098148
TypeSmall organic molecule
Emp. Form.C32H32F2N4O2
Mol. Mass.542.6189
SMILESC[C@@H](N(C\C=C\c1ccc2C[C@]3(Cc2c1)C(=O)Nc1ncccc31)C(=O)[C@@H]1CCCN1C)c1cc(F)cc(F)c1