Reaction Details
TargetC-C chemokine receptor type 1
LigandBDBM50445007
Substrate/Competitorn/a
Meas. Tech.ChEMBL_1281524 (CHEMBL3102090)
IC50 1.3±n/a nM
Citation Hossain, NMensonides-Harsema, MCooper, MEEriksson, TIvanova, SBergström, L Structure activity relationships of fused bicyclic and urea derivatives of spirocyclic compounds as potent CCR1 antagonists. Bioorg Med Chem Lett24:108-12 (2013) 
 
C-C chemokine receptor type 1
Name:C-C chemokine receptor type 1
Type:Enzyme
Mol. Mass.:41180.69
Organism:Homo sapiens (Human)
Description:P32246
Residue:355
BDBM50445007
NameBDBM50445007
Synonyms:CHEMBL3099942
TypeSmall organic molecule
Emp. Form.C23H28ClN3O5
Mol. Mass.461.939
SMILESCNC(=O)Nc1ccc(O)cc1OC[C@@H](O)CN1CCC2(Cc3cc(Cl)ccc3O2)CC1