Reaction Details
TargetRicin
LigandBDBM50445068
Substrate/Competitorn/a
Meas. Tech.ChEMBL_1282600 (CHEMBL3101399)
IC50 39000±n/a nM
Citation Wiget, PAManzano, LAPruet, JMGao, GSaito, RMonzingo, AFJasheway, KRRobertus, JDAnslyn, EV Sulfur incorporation generally improves Ricin inhibition in pterin-appended glycine-phenylalanine dipeptide mimics. Bioorg Med Chem Lett23:6799-804 (2014) Ricin
Name:Ricin
Synonyms:RICI_RICCO
Type:PROTEIN
Mol. Mass.:64090.82
Organism:Ricinus communis
Description:ChEMBL_1286970
Residue:576
BDBM50445068
NameBDBM50445068
Synonyms:CHEMBL3098916
TypeSmall organic molecule
Emp. Form.C16H16N8O2S
Mol. Mass.384.416
SMILESNc1nc2nc(cnc2c(=O)[nH]1)C(=O)NCCNC(=S)Nc1ccccc1