Reaction Details
TargetSerine/threonine-protein kinase pim-1
LigandBDBM106896
Substrate/Competitorn/a
Meas. Tech.ChEMBL_1284449 (CHEMBL3106177)
Ki 0.001000±n/a nM
Citation Burger, MTHan, WLan, JNishiguchi, GBellamacina, CLindval, MAtallah, GDing, YMathur, MMcBride, CBeans, ELMuller, KTamez, VZhang, YHuh, KFeucht, PZavorotinskaya, TDai, YHolash, JCastillo, JLangowski, JWang, YChen, MYGarcia, PD Structure Guided Optimization, in Vitro Activity, and in Vivo Activity of Pan-PIM Kinase Inhibitors. ACS Med Chem Lett4:1193-7 (2013) 
 
Serine/threonine-protein kinase pim-1
Name:Serine/threonine-protein kinase pim-1
Type:Protein
Mol. Mass.:35681.82
Organism:Homo sapiens (Human)
Description:P11309
Residue:313
BDBM106896
NameBDBM106896
Synonyms:US8592455, 96
TypeSmall organic molecule
Emp. Form.C23H22F3N5O2
Mol. Mass.457.4483
SMILESC[C@H]1CN(C[C@@H](N)[C@@H]1O)c1ccncc1NC(=O)c1ccc(F)c(n1)-c1c(F)cccc1F