Reaction Details
TargetSerine/threonine-protein kinase pim-1
LigandBDBM106803
Substrate/Competitorn/a
Meas. Tech.ChEMBL_1284449 (CHEMBL3106177)
Ki 0.001000±n/a nM
Citation Burger, MTHan, WLan, JNishiguchi, GBellamacina, CLindval, MAtallah, GDing, YMathur, MMcBride, CBeans, ELMuller, KTamez, VZhang, YHuh, KFeucht, PZavorotinskaya, TDai, YHolash, JCastillo, JLangowski, JWang, YChen, MYGarcia, PD Structure Guided Optimization, in Vitro Activity, and in Vivo Activity of Pan-PIM Kinase Inhibitors. ACS Med Chem Lett4:1193-7 (2013) 
 
Serine/threonine-protein kinase pim-1
Name:Serine/threonine-protein kinase pim-1
Type:Protein
Mol. Mass.:35681.82
Organism:Homo sapiens (Human)
Description:P11309
Residue:313
BDBM106803
NameBDBM106803
Synonyms:US8592455, 3
TypeSmall organic molecule
Emp. Form.C23H23F3N6O2
Mol. Mass.472.4629
SMILESC[C@H]1CN(C[C@@H](N)[C@@H]1O)c1ccncc1NC(=O)c1nc(c(F)cc1N)-c1c(F)cccc1F