Reaction Details
TargetSerine/threonine-protein kinase pim-1
LigandBDBM50445128
Substrate/Competitorn/a
Meas. Tech.ChEMBL_1284453 (CHEMBL3106341)
Ki<1±n/a nM
Citation Burger, MTHan, WLan, JNishiguchi, GBellamacina, CLindval, MAtallah, GDing, YMathur, MMcBride, CBeans, ELMuller, KTamez, VZhang, YHuh, KFeucht, PZavorotinskaya, TDai, YHolash, JCastillo, JLangowski, JWang, YChen, MYGarcia, PD Structure Guided Optimization, in Vitro Activity, and in Vivo Activity of Pan-PIM Kinase Inhibitors. ACS Med Chem Lett4:1193-7 (2013) 
 
Serine/threonine-protein kinase pim-1
Name:Serine/threonine-protein kinase pim-1
Type:Protein
Mol. Mass.:35681.82
Organism:Homo sapiens (Human)
Description:P11309
Residue:313
BDBM50445128
NameBDBM50445128
Synonyms:CHEMBL3103861
TypeSmall organic molecule
Emp. Form.C21H23N7O
Mol. Mass.389.4536
SMILESN[C@H]1CCCN(C1)c1ccncc1NC(=O)c1nc(ccc1N)-c1cccnc1