Reaction Details
TargetSerine/threonine-protein kinase pim-3
LigandBDBM50445130
Substrate/Competitorn/a
Meas. Tech.ChEMBL_1284448 (CHEMBL3106176)
Ki 15±n/a nM
Citation Burger, MTHan, WLan, JNishiguchi, GBellamacina, CLindval, MAtallah, GDing, YMathur, MMcBride, CBeans, ELMuller, KTamez, VZhang, YHuh, KFeucht, PZavorotinskaya, TDai, YHolash, JCastillo, JLangowski, JWang, YChen, MYGarcia, PD Structure Guided Optimization, in Vitro Activity, and in Vivo Activity of Pan-PIM Kinase Inhibitors. ACS Med Chem Lett4:1193-7 (2013) 
 
Serine/threonine-protein kinase pim-3
Name:Serine/threonine-protein kinase pim-3
Type:Protein
Mol. Mass.:35888.19
Organism:Homo sapiens (Human)
Description:Q86V86
Residue:326
BDBM50445130
NameBDBM50445130
Synonyms:CHEMBL3103859
TypeSmall organic molecule
Emp. Form.C22H24N6O2
Mol. Mass.404.465
SMILESN[C@H]1CCCN(C1)c1ccncc1NC(=O)c1nc(Oc2ccccc2)ccc1N