Reaction Details
TargetSerine/threonine-protein kinase pim-3
LigandBDBM50364776
Substrate/Competitorn/a
Meas. Tech.ChEMBL_1284448 (CHEMBL3106176)
Ki 24±n/a nM
Citation Burger, MTHan, WLan, JNishiguchi, GBellamacina, CLindval, MAtallah, GDing, YMathur, MMcBride, CBeans, ELMuller, KTamez, VZhang, YHuh, KFeucht, PZavorotinskaya, TDai, YHolash, JCastillo, JLangowski, JWang, YChen, MYGarcia, PD Structure Guided Optimization, in Vitro Activity, and in Vivo Activity of Pan-PIM Kinase Inhibitors. ACS Med Chem Lett4:1193-7 (2013) 
 
Serine/threonine-protein kinase pim-3
Name:Serine/threonine-protein kinase pim-3
Type:Protein
Mol. Mass.:35888.19
Organism:Homo sapiens (Human)
Description:Q86V86
Residue:326
BDBM50364776
NameBDBM50364776
Synonyms:CHEMBL1952141 | CHEMBL1952329
TypeSmall organic molecule
Emp. Form.C20H22F3N5O
Mol. Mass.405.4168
SMILESCN1CCC(CNc2ccc3ncc(-c4cccc(OC(F)(F)F)c4)n3n2)CC1