Reaction Details
TargetP2Y purinoceptor 1
LigandBDBM50445207
Substrate/Competitorn/a
Meas. Tech.ChEMBL_1284787 (CHEMBL3107684)
Ki 7.6±n/a nM
Citation Qiao, JXWang, TCRuel, RThibeault, CL'Heureux, ASchumacher, WASpronk, SAHiebert, SBouthillier, GLloyd, JPi, ZSchnur, DMAbell, LMHua, JPrice, LALiu, EWu, QSteinbacher, TEBostwick, JSChang, MZheng, JGao, QMa, BMcDonnell, PAHuang, CSRehfuss, RWexler, RRLam, PY Conformationally constrained ortho-anilino diaryl ureas: discovery of 1-(2-(1'-neopentylspiro[indoline-3,4'-piperidine]-1-yl)phenyl)-3-(4-(trifluoromethoxy)phenyl)urea, a potent, selective, and bioavailable P2Y1 antagonist. J Med Chem56:9275-95 (2013) 
 
P2Y purinoceptor 1
Name:P2Y purinoceptor 1
Type:Enzyme
Mol. Mass.:42090.25
Organism:Homo sapiens (Human)
Description:P47900
Residue:373
BDBM50445207
NameBDBM50445207
Synonyms:CHEMBL3103635
TypeSmall organic molecule
Emp. Form.C25H22F3N3O2
Mol. Mass.453.4563
SMILESFC(F)(F)Oc1ccc(NC(=O)Nc2ccccc2N2CC3(CCC3)c3ccccc23)cc1