Reaction Details
TargetDual specificity tyrosine-phosphorylation-regulated kinase 1A
LigandBDBM50445229
Substrate/Competitorn/a
Meas. Tech.ChEMBL_1284985 (CHEMBL3108566)
Ki 7.6±n/a nM
Citation Gourdain, SDairou, JDenhez, CBui, LCRodrigues-Lima, FJanel, NDelabar, JMCariou, KDodd, RH Development of DANDYs, new 3,5-diaryl-7-azaindoles demonstrating potent DYRK1A kinase inhibitory activity. J Med Chem56:9569-85 (2014) 
 
Dual specificity tyrosine-phosphorylation-regulated kinase 1A
Name:Dual specificity tyrosine-phosphorylation-regulated kinase 1A
Type:Enzyme Catalytic Domain
Mol. Mass.:85573.59
Organism:RAT
Description:Dual-specificity tyrosine-(Y)-phosphorylation regulated kinase 1A 0 RAT::Q63470
Residue:763
BDBM50445229
NameBDBM50445229
Synonyms:CHEMBL3102953
TypeSmall organic molecule
Emp. Form.C19H14N2O4
Mol. Mass.334.3255
SMILESOc1ccc(c(O)c1)-c1cnc2[nH]cc(-c3ccc(O)c(O)c3)c2c1