Reaction Details
TargetNeuronal acetylcholine receptor subunit alpha-3/alpha-6/beta-4
LigandBDBM50445325
Substrate/Competitorn/a
Meas. Tech.ChEMBL_1285337 (CHEMBL3107687)
IC50 31±n/a nM
Citation Luo, SZhangsun, DZhu, XWu, YHu, YChristensen, SHarvey, PJAkcan, MCraik, DJMcIntosh, JM Characterization of a novela-conotoxin TxID from Conus textile that potently blocks rata3ß4 nicotinic acetylcholine receptors. J Med Chem56:9655-63 (2014) 
 
Neuronal acetylcholine receptor subunit alpha-3/alpha-6/beta-4
Name:Neuronal acetylcholine receptor subunit alpha-3/alpha-6/beta-4
Synonyms:Nicotinic acetylcholine receptor alpha6/alpha3/beta4
Type:n/a
Mol. Mass.:n/a
Description:ASSAY_ID of ChEMBL is 2103199
Components:This complex has 3 components.
Component 1
Name:Neuronal acetylcholine receptor subunit beta-4
Type:Enzyme Catalytic Domain
Mol. Mass.:56388.51
Organism:Homo sapiens (Human)
Description:Cholinergic, Nicotinic Alpha6Beta3Beta4Alpha5 0 HUMAN::P30926
Residue:498
Component 2
Name:Neuronal acetylcholine receptor subunit alpha-3
Synonyms:ACHA3_HUMAN Cholinergic, Nicotinic Alpha3Beta2 Cholinergic, Nicotinic Alpha3Beta4x NACHRA3 Neuronal acetylcholine receptor subunit alpha-3 nicotinic central
Type:Enzyme Catalytic Domain
Mol. Mass.:57479.03
Organism:Homo sapiens (Human)
Description:Cholinergic, Nicotinic Alpha3Beta2 0 HUMAN::P32297
Residue:505
Component 3
Name:Neuronal acetylcholine receptor subunit alpha-6
Synonyms:ACHA6_HUMAN Neuronal acetylcholine receptor protein alpha-6 subunit
Type:PROTEIN
Mol. Mass.:56898.54
Organism:Homo sapiens (Human)
Description:EBI_12774
Residue:494
BDBM50445325
NameBDBM50445325
Synonyms:CHEMBL3104238
TypeSmall organic molecule
Emp. Form.C79H125N27O25S4
Mol. Mass.1981.264
SMILESCC[C@H](C)[C@@H]1NC(=O)[C@H](CCC(N)=O)NC(=O)[C@@H]2CCCN2C(=O)[C@H](CC(N)=O)NC(=O)[C@H](Cc2cnc[nH]2)NC(=O)[C@@H](NC(=O)[C@@H](NC(=O)[C@@H]2CSSC[C@H](NC(=O)[C@@H]3CCCN3C(=O)[C@H](CC(O)=O)NC(=O)[C@@H](N)CCCN=C(N)N)C(=O)N[C@@H](CSSC[C@H](NC1=O)C(N)=O)C(=O)N[C@@H](CO)C(=O)N[C@@H](CC(N)=O)C(=O)N1CCC[C@H]1C(=O)N[C@@H](C(C)C)C(=O)N2)[C@@H](C)O)C(C)C