Reaction Details
TargetLysine-specific histone demethylase 1A
LigandBDBM50445339
Substrate/Competitorn/a
Meas. Tech.ChEMBL_1285475 (CHEMBL3108407)
IC50 333±n/a nM
Citation Sorna, VTheisen, ERStephens, BWarner, SLBearss, DJVankayalapati, HSharma, S High-throughput virtual screening identifies novel N'-(1-phenylethylidene)-benzohydrazides as potent, specific, and reversible LSD1 inhibitors. J Med Chem56:9496-508 (2014) 
 
Lysine-specific histone demethylase 1A
Name:Lysine-specific histone demethylase 1A
Type:Enzyme
Mol. Mass.:92901.01
Organism:Homo sapiens (Human)
Description:O60341
Residue:852
BDBM50445339
NameBDBM50445339
Synonyms:CHEMBL3104349 | US9555024, 5
TypeSmall organic molecule
Emp. Form.C14H11ClN2O2
Mol. Mass.274.702
SMILESOc1ccccc1\C=N\NC(=O)c1cccc(Cl)c1