Reaction Details
TargetLysine-specific histone demethylase 1A
LigandBDBM50445347
Substrate/Competitorn/a
Meas. Tech.ChEMBL_1285475 (CHEMBL3108407)
IC50 14±n/a nM
Citation Sorna, VTheisen, ERStephens, BWarner, SLBearss, DJVankayalapati, HSharma, S High-throughput virtual screening identifies novel N'-(1-phenylethylidene)-benzohydrazides as potent, specific, and reversible LSD1 inhibitors. J Med Chem56:9496-508 (2014) 
 
Lysine-specific histone demethylase 1A
Name:Lysine-specific histone demethylase 1A
Type:Enzyme
Mol. Mass.:92901.01
Organism:Homo sapiens (Human)
Description:O60341
Residue:852
BDBM50445347
NameBDBM50445347
Synonyms:CHEMBL3104252
TypeSmall organic molecule
Emp. Form.C17H18ClN3O4S
Mol. Mass.395.861
SMILESCN(C)S(=O)(=O)c1cccc(c1)C(=O)NN=C(C)c1cc(Cl)ccc1O