Reaction Details
TargetLysine-specific histone demethylase 1A
LigandBDBM50445349
Substrate/Competitorn/a
Meas. Tech.ChEMBL_1285479 (CHEMBL3108411)
IC50 20±n/a nM
Citation Sorna, VTheisen, ERStephens, BWarner, SLBearss, DJVankayalapati, HSharma, S High-throughput virtual screening identifies novel N'-(1-phenylethylidene)-benzohydrazides as potent, specific, and reversible LSD1 inhibitors. J Med Chem56:9496-508 (2014) 
 
Lysine-specific histone demethylase 1A
Name:Lysine-specific histone demethylase 1A
Type:Enzyme
Mol. Mass.:92901.01
Organism:Homo sapiens (Human)
Description:O60341
Residue:852
BDBM50445349
NameBDBM50445349
Synonyms:CHEMBL3104261 | US9676701, 63 Enantiomers of 4′-((trans)-2-aminocyclopropyl)biphenyl-3-ol hydrochloride
TypeSmall organic molecule
Emp. Form.C15H15NO
Mol. Mass.225.2857
SMILESN[C@@H]1C[C@H]1c1ccc(cc1)-c1cccc(O)c1