Reaction Details
TargetLysine-specific histone demethylase 1A
LigandBDBM50445346
Substrate/Competitorn/a
Meas. Tech.ChEMBL_1285456 (CHEMBL3108245)
Ki 35±n/a nM
Citation Sorna, VTheisen, ERStephens, BWarner, SLBearss, DJVankayalapati, HSharma, S High-throughput virtual screening identifies novel N'-(1-phenylethylidene)-benzohydrazides as potent, specific, and reversible LSD1 inhibitors. J Med Chem56:9496-508 (2014) 
 
Lysine-specific histone demethylase 1A
Name:Lysine-specific histone demethylase 1A
Type:Enzyme
Mol. Mass.:92901.01
Organism:Homo sapiens (Human)
Description:O60341
Residue:852
BDBM50445346
NameBDBM50445346
Synonyms:CHEMBL3104250
TypeSmall organic molecule
Emp. Form.C19H20ClN3O5S
Mol. Mass.437.897
SMILESCC(=NNC(=O)c1cccc(c1)S(=O)(=O)N1CCOCC1)c1cc(Cl)ccc1O