Reaction Details
TargetA disintegrin and metalloproteinase with thrombospondin motifs 5
LigandBDBM50445422
Substrate/Competitorn/a
Meas. Tech.ChEMBL_1283991 (CHEMBL3107055)
IC50 470±n/a nM
Citation Sogame, SSuenaga, YAtobe, MKawanishi, MTanaka, EMiyoshi, S Discovery of a benzimidazole series of ADAMTS-5 (aggrecanase-2) inhibitors by scaffold hopping. Eur J Med Chem71:250-8 (2014) 
 
A disintegrin and metalloproteinase with thrombospondin motifs 5
Name:A disintegrin and metalloproteinase with thrombospondin motifs 5
Type:Enzyme
Mol. Mass.:101769.09
Organism:Homo sapiens (Human)
Description:Q9UNA0
Residue:930
BDBM50445422
NameBDBM50445422
Synonyms:CHEMBL3104673
TypeSmall organic molecule
Emp. Form.C11H9N3OS
Mol. Mass.231.274
SMILESO=C1CS\C(N1)=C\c1nc2ccccc2[nH]1