Reaction Details
TargetEzrin
LigandBDBM50445465
Substrate/Competitorn/a
Meas. Tech.ChEMBL_1284145 (CHEMBL3107613)
Kd 7900±n/a nM
Citation Paige, MKosturko, GBulut, GMiessau, MRahim, SToretsky, JABrown, MLÜren, A Design, synthesis and biological evaluation of ezrin inhibitors targeting metastatic osteosarcoma. Bioorg Med Chem22:478-87 (2013) 
 
Ezrin
Name:Ezrin
Type:Protein
Mol. Mass.:69408.95
Organism:Homo sapiens (Human)
Description:P15311
Residue:586
BDBM50445465
NameBDBM50445465
Synonyms:CHEMBL3104725
TypeSmall organic molecule
Emp. Form.C17H14N2O4
Mol. Mass.310.3041
SMILESOc1ccc(CC=Nc2cc(O)c3cccnc3c2O)cc1O