Reaction Details
TargetInsulin-like growth factor 1 receptor
LigandBDBM50445474
Substrate/Competitorn/a
Meas. Tech.ChEMBL_1284302 (CHEMBL3108323)
IC50 150±n/a nM
Citation El Amrani, MLai, DDebbab, AAly, AHSiems, KSeidel, CSchnekenburger, MGaigneaux, ADiederich, MFeger, DLin, WProksch, P Protein kinase and HDAC inhibitors from the endophytic fungus Epicoccum nigrum. J Nat Prod77:49-56 (2014) 
 
Insulin-like growth factor 1 receptor
Name:Insulin-like growth factor 1 receptor
Type:Protein
Mol. Mass.:154776.79
Organism:Homo sapiens (Human)
Description:P08069
Residue:1367
BDBM50445474
NameBDBM50445474
Synonyms:CHEMBL3104855
TypeSmall organic molecule
Emp. Form.C18H14O8
Mol. Mass.358.299
SMILESCc1c(O)c(O)c2oc(cc2c1C=O)-c1c(C)c(O)c(O)c(O)c1C=O